{"text_format":"1","workbook":"xlsx","n_sheets":10,"sheets":["Consignes","Version","Analyse graphique","Encodage","Resumé","G_Elec","G_Combustible","G_Eau","Paramètres","DJ"],"not_rendered":{"charts":30,"images":9,"macros":1,"external_links":0,"defined_names":48,"comments":2,"pivot_tables":0},"unopened":[],"bounds":{"document_bytes":16777216,"sheet_cells":100000,"rows_first":2000,"rows_last":500,"rows_between":2000,"halvings":0,"cell_chars":16384,"cell_head_chars":4096},"cells_cut":0,"cells_raw":0,"read":"whole","date_system":"1900"}

{"sheet":"Consignes","index":0,"n_rows":0,"n_cols":0,"rows_kept":0,"cut":false,"hidden":false,"merged":[]}

{"sheet":"Version","index":1,"n_rows":8,"n_cols":2,"rows_kept":8,"cut":false,"hidden":false,"merged":[]}
[]
[]
[]
[]
[]
[]
[null,"Modifications avril 2023 - ICEDD"]
[null,"Mise à jour de valeurs, logo, coûts, etc \n- Possibilité d'aller jusque 2030\n- Degrés jours\n- Logo E+ onglet consigne \n\nNouvelles fonctionnalités \n- Prise en compte d'un compteur mono et d'un compteur bihoraire dans un même bâtiment \n- Autoproduction électrique et autconsommation\n\nAméliorations diverses \n- Résolution de la fonctionnalité pour afficher un certain nombre de bâtiments. N'affichait que N-1 lignes et N_bat s'affichait en D6 au lieu de D7.\n- Suppression de l'onglet caché ResumeBatiment qui ne se mettait pas à jour et qui n'était pas pertinent"]

{"sheet":"Analyse graphique","index":2,"n_rows":288,"n_cols":1,"rows_kept":288,"cut":false,"hidden":false,"merged":[[12,0,12,12],[131,0,131,12],[285,0,285,12],[287,0,287,12]]}
[]
[]
[]
[]
[]
[]
[]
[]
[]
[]
[]
[]
["Graphiques ELECTRICITE"]
[]
[]
[]
[]
[]
[]
[]
[]
[]
[]
[]
[]
[]
[]
[]
[]
[]
{"$rows_left_out":259}
{"sheet":"Encodage","index":3,"n_rows":131,"n_cols":37,"rows_kept":131,"cut":false,"hidden":false,"merged":[[1,0,1,3]]}
[]
["Encodage des données et des factures"]
[]
["Année du 1er encodage:",null,null,2009]
["Choix de degrés jours:",null,null,"16,5/16,5"]
["Secteur général:",null,null,"Aide à la jeunesse"]
["Nombre de bâtiments:",null,null,12]
[]
[null,"Aller à    --->",{"$f":"A13","v":2009},{"$f":"C9+1","v":2010},2011,2012,2013,2014,2015,2016]
[]
[null,"Nom du bâtiment \n","Surface chauffée","Affectation du bâtiment","Horaires d'occupa-tion du bâtiment","Usage énergétique spécifique","Energies renouvelables","Achat\nélectricité (mono-horaire)","Achat\nélectricité Heures pleines","Achat\nélectricité Heures creuses","Coût total électricité","Autoproduction électrcitié","Injection sur le réseau",{"$f":"Paramètres!$A$3","v":"gaz naturel"},{"$f":"Paramètres!$A$4","v":"gasoil"},{"$f":"Paramètres!$A$5","v":"propane"},{"$f":"Paramètres!$A$6","v":"pellets"},{"$f":"Paramètres!$A$7","v":"Autres"},"Coût total combustible","Eau","Coût total Eau","Evol Conso Eau v/v année précédente","Achat\nélectricité \n(total)","Electricité consommée\n(total)","Auto-consommation électrcité","Elec Proportion Heure Creuse\n(Achat)","Evol Conso Elec v/v année précédente","Cons spéc d'électricité","Cons spéc d'électricité moy du secteur (2012)","Combustible \n(total)","% de norma-lisation","Combustible\n(total) \nnormalisé","Cons spéc \nnormalisée \nde combustible","Evol Cons spéc normalisée de combustible v/v année précédente","Cons spéc chauffage moy du secteur (2012)","Evol Conso spéc normalisée de combustible v/v année du 1er encodage","Potentiel d'économie de combustible"]
[null,"Sélectionner les bâtiments","m²",null,null,null,null,"kWh","kWh","kWh","euro","kWh","kWh",{"$f":"Paramètres!$B$3","v":"kWhs"},{"$f":"Paramètres!$B$4","v":"litre"},{"$f":"Paramètres!$B$5","v":"m³"},{"$f":"Paramètres!$B$6","v":"kg"},{"$f":"Paramètres!$B$7","v":"kWh"},"euro","m³","euro","%","kWh","kWh","%","%","%","kWh/m²","kWh/m²","kWhi","%","kWhi","kWhi/m²","%","kWhi/m²","%","kWh²/m²"]
[{"$f":"D4","v":2009}]
[{"$f":"A13","v":2009},"Bâtiment 1",null,"A sélectionner dans la liste déroulante",null,"à encoder","à encoder",null,null,null,null,null,null,null,null,null,null,null,null,null,null,null,{"$f":"SUM(H14:J14)","v":0},0,{"$f":"IFERROR((L14-M14)/L14,\"NA\")","v":"NA"},{"$f":"IFERROR(J14/W14,\"NA\")","v":"NA"},null,{"$f":"IFERROR(X14/C14,0)","v":0},{"$f":"VLOOKUP(D14,Paramètres!$A$24:$D$36,3)","v":100},{"$f":"N14*Paramètres!$C$3+O14*Paramètres!$C$4+Encodage!P14*Paramètres!$C$5+Encodage!Q14*Paramètres!$C$6+R14*Paramètres!$C$7","v":0},{"$f":"VLOOKUP(D14,Paramètres!$A$24:$E$36,5)","v":0.85},{"$f":"IFERROR(AD14*(1-AE14)+(AD14*AE14*DJ!$D$3/VLOOKUP(Encodage!A14,DJ!$A$3:$D$25,4)),0)","v":0},{"$f":"IFERROR(AF14/C14,0)","v":0},null,{"$f":"VLOOKUP(D14,Paramètres!$A$24:$D$36,2)","v":100},{"$f":"IFERROR(AG14/AG$14,\"\")","v":""},{"$f":"AF14*AG14","v":0}]
[{"$f":"A13","v":2009},"Bâtiment 2",null,"A sélectionner dans la liste déroulante",null,"à encoder","à encoder",null,null,null,null,null,null,null,null,null,null,null,null,null,null,null,{"$f":"SUM(H15:J15)","v":0},{"$f":"W15+L15-M15","v":0},{"$f":"IFERROR((L15-M15)/L15,\"NA\")","v":"NA"},"NA",null,0,{"$f":"VLOOKUP(D15,Paramètres!$A$24:$D$36,3)","v":100},{"$f":"N15*Paramètres!$C$3+O15*Paramètres!$C$4+Encodage!P15*Paramètres!$C$5+Encodage!Q15*Paramètres!$C$6+R15*Paramètres!$C$7","v":0},{"$f":"VLOOKUP(D15,Paramètres!$A$24:$E$36,5)","v":0.85},{"$f":"IFERROR(AD15*(1-AE15)+(AD15*AE15*DJ!$D$3/VLOOKUP(Encodage!A15,DJ!$A$3:$D$25,4)),0)","v":0},{"$f":"IFERROR(AF15/C15,0)","v":0},null,{"$f":"VLOOKUP(D15,Paramètres!$A$24:$D$36,2)","v":100},"",{"$f":"AF15*AG15","v":0}]
[{"$f":"A15","v":2009},"Bâtiment 3",null,"A sélectionner dans la liste déroulante",null,"à encoder","à encoder",null,null,null,null,null,null,null,null,null,null,null,null,null,null,null,0,0,{"$f":"IFERROR((L16-M16)/L16,\"NA\")","v":"NA"},"NA",null,0,{"$f":"VLOOKUP(D16,Paramètres!$A$24:$D$36,3)","v":100},{"$f":"N16*Paramètres!$C$3+O16*Paramètres!$C$4+Encodage!P16*Paramètres!$C$5+Encodage!Q16*Paramètres!$C$6+R16*Paramètres!$C$7","v":0},{"$f":"VLOOKUP(D16,Paramètres!$A$24:$E$36,5)","v":0.85},{"$f":"IFERROR(AD16*(1-AE16)+(AD16*AE16*DJ!$D$3/VLOOKUP(Encodage!A16,DJ!$A$3:$D$25,4)),0)","v":0},0,null,{"$f":"VLOOKUP(D16,Paramètres!$A$24:$D$36,2)","v":100},"",0]
[2009,"Bâtiment 4",null,"A sélectionner dans la liste déroulante",null,"à encoder","à encoder",null,null,null,null,null,null,null,null,null,null,null,null,null,null,null,{"$f":"SUM(H17:J17)","v":0},0,"NA","NA",null,0,{"$f":"VLOOKUP(D17,Paramètres!$A$24:$D$36,3)","v":100},{"$f":"N17*Paramètres!$C$3+O17*Paramètres!$C$4+Encodage!P17*Paramètres!$C$5+Encodage!Q17*Paramètres!$C$6+R17*Paramètres!$C$7","v":0},{"$f":"VLOOKUP(D17,Paramètres!$A$24:$E$36,5)","v":0.85},{"$f":"IFERROR(AD17*(1-AE17)+(AD17*AE17*DJ!$D$3/VLOOKUP(Encodage!A17,DJ!$A$3:$D$25,4)),0)","v":0},0,null,{"$f":"VLOOKUP(D17,Paramètres!$A$24:$D$36,2)","v":100},"",0]
[2009,"Bâtiment 5",null,"A sélectionner dans la liste déroulante",null,"à encoder","à encoder",null,null,null,null,null,null,null,null,null,null,null,null,null,null,null,0,0,"NA","NA",null,0,{"$f":"VLOOKUP(D18,Paramètres!$A$24:$D$36,3)","v":100},{"$f":"N18*Paramètres!$C$3+O18*Paramètres!$C$4+Encodage!P18*Paramètres!$C$5+Encodage!Q18*Paramètres!$C$6+R18*Paramètres!$C$7","v":0},{"$f":"VLOOKUP(D18,Paramètres!$A$24:$E$36,5)","v":0.85},{"$f":"IFERROR(AD18*(1-AE18)+(AD18*AE18*DJ!$D$3/VLOOKUP(Encodage!A18,DJ!$A$3:$D$25,4)),0)","v":0},0,null,{"$f":"VLOOKUP(D18,Paramètres!$A$24:$D$36,2)","v":100},"",0]
[2009,"Bâtiment 6",null,"A sélectionner dans la liste déroulante",null,"à encoder","à encoder",null,null,null,null,null,null,null,null,null,null,null,null,null,null,null,0,{"$f":"W19+L19-M19","v":0},"NA","NA",null,0,{"$f":"VLOOKUP(D19,Paramètres!$A$24:$D$36,3)","v":100},{"$f":"N19*Paramètres!$C$3+O19*Paramètres!$C$4+Encodage!P19*Paramètres!$C$5+Encodage!Q19*Paramètres!$C$6+R19*Paramètres!$C$7","v":0},{"$f":"VLOOKUP(D19,Paramètres!$A$24:$E$36,5)","v":0.85},{"$f":"IFERROR(AD19*(1-AE19)+(AD19*AE19*DJ!$D$3/VLOOKUP(Encodage!A19,DJ!$A$3:$D$25,4)),0)","v":0},0,null,{"$f":"VLOOKUP(D19,Paramètres!$A$24:$D$36,2)","v":100},"",0]
[2009,"Bâtiment 7",null,"A sélectionner dans la liste déroulante",null,"à encoder","à encoder",null,null,null,null,null,null,null,null,null,null,null,null,null,null,null,0,0,"NA","NA",null,0,{"$f":"VLOOKUP(D20,Paramètres!$A$24:$D$36,3)","v":100},{"$f":"N20*Paramètres!$C$3+O20*Paramètres!$C$4+Encodage!P20*Paramètres!$C$5+Encodage!Q20*Paramètres!$C$6+R20*Paramètres!$C$7","v":0},{"$f":"VLOOKUP(D20,Paramètres!$A$24:$E$36,5)","v":0.85},{"$f":"IFERROR(AD20*(1-AE20)+(AD20*AE20*DJ!$D$3/VLOOKUP(Encodage!A20,DJ!$A$3:$D$25,4)),0)","v":0},0,null,{"$f":"VLOOKUP(D20,Paramètres!$A$24:$D$36,2)","v":100},"",0]
[2009,"Bâtiment 8",null,"A sélectionner dans la liste déroulante",null,"à encoder","à encoder",null,null,null,null,null,null,null,null,null,null,null,null,null,null,null,0,0,"NA","NA",null,0,{"$f":"VLOOKUP(D21,Paramètres!$A$24:$D$36,3)","v":100},{"$f":"N21*Paramètres!$C$3+O21*Paramètres!$C$4+Encodage!P21*Paramètres!$C$5+Encodage!Q21*Paramètres!$C$6+R21*Paramètres!$C$7","v":0},{"$f":"VLOOKUP(D21,Paramètres!$A$24:$E$36,5)","v":0.85},{"$f":"IFERROR(AD21*(1-AE21)+(AD21*AE21*DJ!$D$3/VLOOKUP(Encodage!A21,DJ!$A$3:$D$25,4)),0)","v":0},0,null,{"$f":"VLOOKUP(D21,Paramètres!$A$24:$D$36,2)","v":100},"",0]
[2009,"Bâtiment 9",null,"A sélectionner dans la liste déroulante",null,"à encoder","à encoder",null,null,null,null,null,null,null,null,null,null,null,null,null,null,null,0,0,"NA","NA",null,0,{"$f":"VLOOKUP(D22,Paramètres!$A$24:$D$36,3)","v":100},{"$f":"N22*Paramètres!$C$3+O22*Paramètres!$C$4+Encodage!P22*Paramètres!$C$5+Encodage!Q22*Paramètres!$C$6+R22*Paramètres!$C$7","v":0},{"$f":"VLOOKUP(D22,Paramètres!$A$24:$E$36,5)","v":0.85},{"$f":"IFERROR(AD22*(1-AE22)+(AD22*AE22*DJ!$D$3/VLOOKUP(Encodage!A22,DJ!$A$3:$D$25,4)),0)","v":0},0,null,{"$f":"VLOOKUP(D22,Paramètres!$A$24:$D$36,2)","v":100},"",0]
[2009,"Bâtiment 10",null,"A sélectionner dans la liste déroulante",null,"à encoder","à encoder",null,null,null,null,null,null,null,null,null,null,null,null,null,null,null,0,0,"NA","NA",null,0,{"$f":"VLOOKUP(D23,Paramètres!$A$24:$D$36,3)","v":100},{"$f":"N23*Paramètres!$C$3+O23*Paramètres!$C$4+Encodage!P23*Paramètres!$C$5+Encodage!Q23*Paramètres!$C$6+R23*Paramètres!$C$7","v":0},{"$f":"VLOOKUP(D23,Paramètres!$A$24:$E$36,5)","v":0.85},{"$f":"IFERROR(AD23*(1-AE23)+(AD23*AE23*DJ!$D$3/VLOOKUP(Encodage!A23,DJ!$A$3:$D$25,4)),0)","v":0},0,null,{"$f":"VLOOKUP(D23,Paramètres!$A$24:$D$36,2)","v":100},"",0]
[2009,"Bâtiment 11",null,"A sélectionner dans la liste déroulante",null,"à encoder","à encoder",null,null,null,null,null,null,null,null,null,null,null,null,null,null,null,0,0,"NA","NA",null,0,{"$f":"VLOOKUP(D24,Paramètres!$A$24:$D$36,3)","v":100},{"$f":"N24*Paramètres!$C$3+O24*Paramètres!$C$4+Encodage!P24*Paramètres!$C$5+Encodage!Q24*Paramètres!$C$6+R24*Paramètres!$C$7","v":0},{"$f":"VLOOKUP(D24,Paramètres!$A$24:$E$36,5)","v":0.85},{"$f":"IFERROR(AD24*(1-AE24)+(AD24*AE24*DJ!$D$3/VLOOKUP(Encodage!A24,DJ!$A$3:$D$25,4)),0)","v":0},0,null,{"$f":"VLOOKUP(D24,Paramètres!$A$24:$D$36,2)","v":100},"",0]
[2009,"Bâtiment 12",null,"A sélectionner dans la liste déroulante",null,"à encoder","à encoder",null,null,null,null,null,null,null,null,null,null,null,null,null,null,null,0,0,"NA","NA",null,0,{"$f":"VLOOKUP(D25,Paramètres!$A$24:$D$36,3)","v":100},{"$f":"N25*Paramètres!$C$3+O25*Paramètres!$C$4+Encodage!P25*Paramètres!$C$5+Encodage!Q25*Paramètres!$C$6+R25*Paramètres!$C$7","v":0},{"$f":"VLOOKUP(D25,Paramètres!$A$24:$E$36,5)","v":0.85},{"$f":"IFERROR(AD25*(1-AE25)+(AD25*AE25*DJ!$D$3/VLOOKUP(Encodage!A25,DJ!$A$3:$D$25,4)),0)","v":0},0,null,{"$f":"VLOOKUP(D25,Paramètres!$A$24:$D$36,2)","v":100},"",0]
[2009,"Total",{"$f":"SUM(C14:C25)","v":0},null,null,null,null,{"$f":"SUM(H14:H25)","v":0},{"$f":"SUM(I14:I25)","v":0},{"$f":"SUM(J14:J25)","v":0},{"$f":"SUM(K14:K25)","v":0},null,null,{"$f":"SUM(N14:N25)","v":0},0,0,0,0,0,null,0,null,{"$f":"SUM(W14:W25)","v":0},{"$f":"SUM(X14:X25)","v":0},null,null,null,{"$f":"IFERROR(W26/C26,0)","v":0},{"$f":"VLOOKUP($D$6,Paramètres!$A$24:$D$36,3)","v":0},{"$f":"SUM(AD14:AD25)","v":0},null,{"$f":"SUM(AF14:AF25)","v":0},0,null,{"$f":"VLOOKUP($D$6,Paramètres!$A$24:$D$36,2)","v":0},""]
[]
[{"$f":"A13+1","v":2010}]
[{"$f":"A28","v":2010},{"$f":"B14","v":"Bâtiment 1"},0,"A sélectionner dans la liste déroulante",{"$f":"E14","v":0},{"$f":"F14","v":"à encoder"},{"$f":"G14","v":"à encoder"},null,null,null,null,null,null,null,null,null,null,null,null,null,null,{"$f":"IF(T29=0,,T29/T14-1)","v":0},{"$f":"SUM(H29:J29)","v":0},0,{"$f":"IFERROR((L29-M29)/L29,\"NA\")","v":"NA"},{"$f":"IFERROR(J29/W29,\"NA\")","v":"NA"},{"$f":"IF(X29=0,0,X29/X14-1)","v":0},{"$f":"IFERROR(X29/C29,0)","v":0},{"$f":"VLOOKUP(D29,Paramètres!$A$24:$D$36,3)","v":100},{"$f":"N29*Paramètres!$C$3+O29*Paramètres!$C$4+Encodage!P29*Paramètres!$C$5+Encodage!Q29*Paramètres!$C$6+R29*Paramètres!$C$7","v":0},{"$f":"VLOOKUP(D29,Paramètres!$A$24:$E$36,5)","v":0.85},{"$f":"IFERROR(AD29*(1-AE29)+(AD29*AE29*DJ!$D$3/VLOOKUP(Encodage!A29,DJ!$A$3:$D$25,4)),0)","v":0},{"$f":"IFERROR(AF29/C29,0)","v":0},{"$f":"IF(AF29=0,,AF29/AF14-1)","v":0},{"$f":"VLOOKUP(D29,Paramètres!$A$24:$D$36,2)","v":100},{"$f":"IFERROR(AG29/AG$14,\"\")","v":""},{"$f":"AF29*AG29","v":0}]
[{"$f":"A29","v":2010},"Bâtiment 2",0,"A sélectionner dans la liste déroulante",0,{"$f":"F15","v":"à encoder"},"à encoder",null,null,null,null,null,null,null,null,null,null,null,null,null,null,{"$f":"IF(T30=0,,T30/T15-1)","v":0},{"$f":"SUM(H30:J30)","v":0},{"$f":"W30+L30-M30","v":0},{"$f":"IFERROR((L30-M30)/L30,\"NA\")","v":"NA"},"NA",{"$f":"IF(X30=0,0,X30/X30-1)","v":0},{"$f":"IFERROR(X30/C30,0)","v":0},{"$f":"VLOOKUP(D30,Paramètres!$A$24:$D$36,3)","v":100},{"$f":"N30*Paramètres!$C$3+O30*Paramètres!$C$4+Encodage!P30*Paramètres!$C$5+Encodage!Q30*Paramètres!$C$6+R30*Paramètres!$C$7","v":0},{"$f":"VLOOKUP(D30,Paramètres!$A$24:$E$36,5)","v":0.85},{"$f":"IFERROR(AD30*(1-AE30)+(AD30*AE30*DJ!$D$3/VLOOKUP(Encodage!A30,DJ!$A$3:$D$25,4)),0)","v":0},0,{"$f":"IF(AF30=0,,AF30/AF15-1)","v":0},{"$f":"VLOOKUP(D30,Paramètres!$A$24:$D$36,2)","v":100},"",0]
{"$rows_left_out":102}
{"sheet":"Resumé","index":4,"n_rows":42,"n_cols":10,"rows_kept":42,"cut":false,"hidden":false,"merged":[[1,1,1,9]]}
[]
[null,"Evolution des consommations totales de tous les bâtiments"]
[]
[null,"Consommations",{"$f":"Encodage!D4","v":2009},{"$f":"C4+1","v":2010},2011,2012,2013,2014,2015,2016]
[null,"Consommation Elec totale [kWh]",{"$f":"Encodage!$W26","v":0},{"$f":"Encodage!W41","v":0},{"$f":"Encodage!W56","v":0},{"$f":"Encodage!$W71","v":0},{"$f":"Encodage!$W86","v":0},{"$f":"Encodage!$W101","v":0},{"$f":"Encodage!$W116","v":0},{"$f":"Encodage!$W131","v":0}]
[null,"Cons. Elec heures pleines [kWh]",{"$f":"Encodage!$I26","v":0},{"$f":"Encodage!I41","v":0},{"$f":"Encodage!I56","v":0},{"$f":"Encodage!$I71","v":0},{"$f":"Encodage!$I86","v":0},{"$f":"Encodage!$I101","v":0},{"$f":"Encodage!$I116","v":0},{"$f":"Encodage!$I131","v":0}]
[null,"Cons. Elec heures creuses [kWh]",{"$f":"Encodage!$J26","v":0},{"$f":"Encodage!J41","v":0},{"$f":"Encodage!J56","v":0},{"$f":"Encodage!$J71","v":0},{"$f":"Encodage!$J86","v":0},{"$f":"Encodage!$J101","v":0},{"$f":"Encodage!$J116","v":0},{"$f":"Encodage!$J131","v":0}]
[null,"Cons. élect spécifique [kWh/m²]",{"$f":"IFERROR(Encodage!$AB26,0)","v":0},{"$f":"IFERROR(Encodage!$AB41,0)","v":0},{"$f":"IFERROR(Encodage!$AB56,0)","v":0},{"$f":"IFERROR(Encodage!$AB71,0)","v":0},{"$f":"IFERROR(Encodage!$AB86,0)","v":0},{"$f":"IFERROR(Encodage!$AB101,0)","v":0},{"$f":"IFERROR(Encodage!$AB116,0)","v":0},{"$f":"IFERROR(Encodage!$AB131,0)","v":0}]
[null,{"$f":"\"Cons. moyenne du secteur (= \"&C9&\" kWh/m²)\"","v":"Cons. moyenne du secteur (= 0 kWh/m²)"},{"$f":"VLOOKUP(Encodage!D6,Paramètres!$A$24:$D$36,3)","v":0},{"$f":"$C$9","v":0},{"$f":"$C$9","v":0},0,0,0,0,0]
[null,"Consommation de combustibles [kWhi]",{"$f":"Encodage!$AD26","v":0},{"$f":"Encodage!AD41","v":0},{"$f":"Encodage!AD56","v":0},{"$f":"Encodage!$AD71","v":0},{"$f":"Encodage!$AD86","v":0},{"$f":"Encodage!$AD101","v":0},{"$f":"Encodage!$AD116","v":0},{"$f":"Encodage!$AD131","v":0}]
[null,"Cons. de combustible normalisé [kWhi]",{"$f":"Encodage!$AF26","v":0},{"$f":"Encodage!$AF41","v":0},{"$f":"Encodage!$AF56","v":0},{"$f":"Encodage!$AF71","v":0},{"$f":"Encodage!$AF86","v":0},{"$f":"Encodage!$AF101","v":0},{"$f":"Encodage!$AF116","v":0},{"$f":"Encodage!$AF131","v":0}]
[null,"Cons. combustible spécifique normalisée [kWhi/m²]",{"$f":"IFERROR(Encodage!$AG26,0)","v":0},{"$f":"IFERROR(Encodage!AG41,0)","v":0},{"$f":"IFERROR(Encodage!AG56,0)","v":0},{"$f":"IFERROR(Encodage!$AG71,0)","v":0},{"$f":"IFERROR(Encodage!$AG86,0)","v":0},{"$f":"IFERROR(Encodage!$AG101,0)","v":0},{"$f":"IFERROR(Encodage!$AG116,0)","v":0},{"$f":"IFERROR(Encodage!$AG131,0)","v":0}]
[null,{"$f":"\"Consommation moyenne du secteur (= \"&C13&\" kWh/m²)\"","v":"Consommation moyenne du secteur (= 0 kWh/m²)"},{"$f":"VLOOKUP(Encodage!D6,Paramètres!$A$24:$D$36,2)","v":0},{"$f":"$C$13","v":0},0,0,0,0,0,0]
[null,"Degrés jours (16,5/16,5)",{"$f":"VLOOKUP(C4,DJ!$A$4:$D$25,4)","v":2212},{"$f":"VLOOKUP(D4,DJ!$A$4:$D$25,4)","v":2703},{"$f":"VLOOKUP(E4,DJ!$A$4:$D$25,4)","v":1928},{"$f":"VLOOKUP(F4,DJ!$A$4:$D$25,4)","v":2327},{"$f":"VLOOKUP(G4,DJ!$A$4:$D$25,4)","v":2537},{"$f":"VLOOKUP(H4,DJ!$A$4:$D$25,4)","v":1828},{"$f":"VLOOKUP(I4,DJ!$A$4:$D$25,4)","v":2112},{"$f":"VLOOKUP(J4,DJ!$A$4:$D$25,4)","v":2329}]
[null,"Eau (m³)",{"$f":"Encodage!$T26","v":0},{"$f":"Encodage!T41","v":0},{"$f":"Encodage!T56","v":0},{"$f":"Encodage!$T71","v":0},{"$f":"Encodage!$T86","v":0},{"$f":"Encodage!$T101","v":0},{"$f":"Encodage!$T116","v":0},{"$f":"Encodage!$T131","v":0}]
[null,"Coût total elec (€)",{"$f":"Encodage!$K$26","v":0},{"$f":"Encodage!$K$41","v":0},{"$f":"Encodage!$K$56","v":0},{"$f":"Encodage!$K$71","v":0},{"$f":"Encodage!$K$86","v":0},{"$f":"Encodage!$K$101","v":0},{"$f":"Encodage!K116","v":0},{"$f":"Encodage!$K$131","v":0}]
[null,"Coût total combustible (€)",{"$f":"Encodage!$S$26","v":0},{"$f":"Encodage!$S$41","v":0},{"$f":"Encodage!$S$56","v":0},{"$f":"Encodage!$S$71","v":0},{"$f":"Encodage!$S$86","v":0},{"$f":"Encodage!$S$101","v":0},{"$f":"Encodage!S117","v":0},{"$f":"Encodage!$S$131","v":0}]
[null,"Coût total eau (€)",{"$f":"Encodage!$U$26","v":0},{"$f":"Encodage!$U$41","v":0},{"$f":"Encodage!$U$56","v":0},{"$f":"Encodage!$U$71","v":0},{"$f":"Encodage!$U$86","v":0},{"$f":"Encodage!$U$101","v":0},{"$f":"Encodage!U118","v":0},{"$f":"Encodage!$U$131","v":0}]
[]
[null,"Evolution par rapport à l’année du 1er encodage",{"$f":"C4","v":2009},2010,2011,2012,2013,2014,2015,2016]
[null,{"$f":"B5","v":"Consommation Elec totale [kWh]"},{"$f":"IFERROR(C5/$C5,0)","v":0},{"$f":"IFERROR(D5/$C5,0)","v":0},0,0,0,0,0,0]
[null,{"$f":"B6","v":"Cons. Elec heures pleines [kWh]"},{"$f":"IFERROR(C6/$C6,0)","v":0},0,0,0,0,0,0,0]
[null,{"$f":"B7","v":"Cons. Elec heures creuses [kWh]"},{"$f":"IFERROR(C7/$C7,0)","v":0},{"$f":"IFERROR(D7/$C7,0)","v":0},0,0,0,0,0,0]
[null,{"$f":"B10","v":"Consommation de combustibles [kWhi]"},{"$f":"IFERROR(C10/$C10,0)","v":0},{"$f":"IFERROR(D10/$C10,0)","v":0},0,0,0,0,0,0]
[null,{"$f":"B11","v":"Cons. de combustible normalisé [kWhi]"},{"$f":"IFERROR(C11/$C11,0)","v":0},{"$f":"IFERROR(D11/$C11,0)","v":0},0,0,0,0,0,0]
[null,{"$f":"B12","v":"Cons. combustible spécifique normalisée [kWhi/m²]"},{"$f":"IFERROR(C12/$C12,0)","v":0},{"$f":"IFERROR(D12/$C12,0)","v":0},0,0,0,0,0,0]
[null,{"$f":"B15","v":"Eau (m³)"},{"$f":"IFERROR(C15/$C15,0)","v":0},{"$f":"IFERROR(D15/$C15,0)","v":0},0,0,0,0,0,0]
[null,"Coût total elec",{"$f":"IFERROR(C16/$C16,0)","v":0},0,0,0,0,0,0,0]
[null,"Coût total combustible",{"$f":"IFERROR(C17/$C17,0)","v":0},0,0,0,0,0,0,0]
[null,"Coût total eau",{"$f":"IFERROR(C18/$C18,0)","v":0},0,0,0,0,0,0,0]
{"$rows_left_out":13}
{"sheet":"G_Elec","index":5,"n_rows":126,"n_cols":17,"rows_kept":126,"cut":false,"hidden":false,"merged":[[124,0,124,5],[124,6,124,10],[124,11,124,15],[124,16,124,20],[125,0,125,5],[125,6,125,10],[125,11,125,15],[125,16,125,20],[100,0,100,5],[100,6,100,10],[100,11,100,15],[100,16,100,20],[102,0,102,5],[102,6,102,10],[102,11,102,15],[102,16,102,20]]}
[]
[]
[]
[]
[]
[]
[]
[]
[]
[]
[]
[]
[]
[]
[]
[]
[]
[]
[]
[]
[]
[]
[]
[]
[]
[]
[]
[]
[]
[]
{"$rows_left_out":97}
{"sheet":"G_Combustible","index":6,"n_rows":0,"n_cols":0,"rows_kept":0,"cut":false,"hidden":false,"merged":[[41,0,41,5],[41,6,41,10],[60,6,60,10]]}

{"sheet":"G_Eau","index":7,"n_rows":0,"n_cols":0,"rows_kept":0,"cut":false,"hidden":false,"merged":[[24,0,24,5],[24,6,24,10]]}

{"sheet":"Paramètres","index":8,"n_rows":62,"n_cols":5,"rows_kept":62,"cut":false,"hidden":true,"merged":[]}
["Coefficients de conversion:"]
["Electricité","kWh",2.5,{"$f":"\"kWhp\"&\"/\"&B2","v":"kWhp/kWh"}]
["gaz naturel","kWhs",0.90300000000000002,"kWhp/kWhs"]
["gasoil","litre",{"$f":"36500/3600","v":10.138888888888889},"kWhp/litre"]
["propane","m³",6.5555555555555598,"kWhp/m³"]
["pellets","kg",4,"kWhp/kg"]
["Autres","kWh",1,"kWhp/kWh"]
[]
["Usage énergétique"]
["Chauffage"]
["Eau chaude sanitaire (ECS)"]
["Cuisine"]
["Ch + ECS"]
["Ch + cuisine"]
["ECS + Cuisine"]
["Ch + ECS + Cuisine"]
["cuisine collective"]
["air-conditionné"]
["chauffage électrique"]
["piscine"]
[]
["Consommation moyenne du secteur (2012)"]
[null,"Chauffage","Elec",null,"Rapport Normalisation"]
[{"$f":"DJ!A28","v":"A sélectionner dans la liste déroulante"},100,100,"kWh/m²",{"$f":"DJ!B28","v":0.85}]
[{"$f":"DJ!A29","v":"Accueil de jour"},0,0,"kWh/m²",{"$f":"DJ!B29","v":0.85}]
[{"$f":"DJ!A30","v":"Bureau privé HT"},102,138,"kWh/m²",{"$f":"DJ!B30","v":0.85}]
[{"$f":"DJ!A31","v":"Bureau public HT"},165,65,"kWh/m²",{"$f":"DJ!B31","v":0.85}]
[{"$f":"DJ!A32","v":"Centre d’insertion socio-professionnel"},0,0,"kWh/m²",{"$f":"DJ!B32","v":0.85}]
[{"$f":"DJ!A33","v":"Crèche"},0,0,"kWh/m²",{"$f":"DJ!B33","v":0.85}]
[{"$f":"DJ!A34","v":"École"},143,26,"kWh/m²",{"$f":"DJ!B34","v":0.85}]
{"$rows_left_out":33}
{"sheet":"DJ","index":9,"n_rows":40,"n_cols":6,"rows_kept":40,"cut":false,"hidden":true,"merged":[[2,5,2,9]]}
[]
["Degrés jours","15/15","16,5/16,5",{"$f":"IF(Encodage!$D$5=$B$2,B2,C2)","v":"16,5/16,5"}]
["degré jour normaux",1913,2301,{"$f":"IF(Encodage!$D$5=$B$2,B3,C3)","v":2301},null,"Les degrés jours normaux  sont  la  moyenne des degrés jours des 30 dernières années (de 1986 à 2015). Cette  moyenne est revue par l'IRM tous les 5 ans "]
[2009,1819.7,2212,{"$f":"IF(Encodage!$D$5=$B$2,B4,C4)","v":2212}]
[2010,2309,2703,{"$f":"IF(Encodage!$D$5=$B$2,B5,C5)","v":2703}]
[2011,1514.5,1928,{"$f":"IF(Encodage!$D$5=$B$2,B6,C6)","v":1928}]
[2012,1914.7,2327,{"$f":"IF(Encodage!$D$5=$B$2,B7,C7)","v":2327}]
[2013,2137.6999999999998,2537,{"$f":"IF(Encodage!$D$5=$B$2,B8,C8)","v":2537}]
[2014,1424.1,1828,{"$f":"IF(Encodage!$D$5=$B$2,B9,C9)","v":1828}]
[2015,1688.3,2112,{"$f":"IF(Encodage!$D$5=$B$2,B10,C10)","v":2112}]
[2016,1947.6,2329,{"$f":"IF(Encodage!$D$5=$B$2,B11,C11)","v":2329}]
[2017,1780.4,2155,{"$f":"IF(Encodage!$D$5=$B$2,B12,C12)","v":2155}]
[2018,1739.3,2091,{"$f":"IF(Encodage!$D$5=$B$2,B13,C13)","v":2091}]
[2019,1675.65,2076,{"$f":"IF(Encodage!$D$5=$B$2,B14,C14)","v":2076}]
[2020,1517.85,1867,{"$f":"IF(Encodage!$D$5=$B$2,B15,C15)","v":1867}]
[2021,1909.2,2286,{"$f":"IF(Encodage!$D$5=$B$2,B16,C16)","v":2286}]
[2022,1554.1,1922,{"$f":"IF(Encodage!$D$5=$B$2,B17,C17)","v":1922}]
[2023,null,null,{"$f":"IF(Encodage!$D$5=$B$2,B18,C18)","v":0}]
[2024,null,null,{"$f":"IF(Encodage!$D$5=$B$2,B19,C19)","v":0}]
[2025,null,null,{"$f":"IF(Encodage!$D$5=$B$2,B20,C20)","v":0}]
[2026,null,null,{"$f":"IF(Encodage!$D$5=$B$2,B21,C21)","v":0}]
[2027,null,null,{"$f":"IF(Encodage!$D$5=$B$2,B22,C22)","v":0}]
[2028,null,null,{"$f":"IF(Encodage!$D$5=$B$2,B23,C23)","v":0}]
[2029,null,null,{"$f":"IF(Encodage!$D$5=$B$2,B24,C24)","v":0}]
[2030,null,null,{"$f":"IF(Encodage!$D$5=$B$2,B25,C25)","v":0}]
[]
["Rapport Normalisation"]
["A sélectionner dans la liste déroulante",0.85]
["Accueil de jour",0.85]
["Bureau privé HT",0.85]
{"$rows_left_out":10}