{"text_format":"1","workbook":"xlsx","n_sheets":11,"sheets":["Consignes","ResumeBatiment","Analyse graphique","Encodage","Resumé","G_Elec","Feuil1","G_Combustible","G_Eau","Paramètres","DJ"],"not_rendered":{"charts":29,"images":6,"macros":1,"external_links":0,"defined_names":52,"comments":2,"pivot_tables":1},"unopened":[],"bounds":{"document_bytes":16777216,"sheet_cells":100000,"rows_first":2000,"rows_last":500,"rows_between":2000,"halvings":0,"cell_chars":16384,"cell_head_chars":4096},"cells_cut":0,"cells_raw":0,"read":"whole","date_system":"1900"}

{"sheet":"Consignes","index":0,"n_rows":0,"n_cols":0,"rows_kept":0,"cut":false,"hidden":false,"merged":[]}

{"sheet":"ResumeBatiment","index":1,"n_rows":10,"n_cols":9,"rows_kept":10,"cut":false,"hidden":true,"merged":[]}
["Batiment","(Tous)"]
[]
[null,"Étiquettes de colonnes"]
["Valeurs",2010,2011,2012,2013,2014,2015,2016,2017]
["Somme de Electricité ",318905.99600000004,312719.99399999995,317661.99,316139.99200000003,0,0,0,0]
["Somme de Electricité Heures pleines",0,0,0,0,0,0,0,0]
["Somme de Electricité Heures creuses",0,0,0,0,0,0,0,0]
["Somme de Cons spéc d'électricité",244.0846845526776,239.35003762688407,243.13254800079363,241.96763772815893,0,0,0,0]
["Somme de Cons spéc d'électricité moy du secteur",100,100,100,100,100,100,100,100]
["Somme de Combustible ",1864875.6,1631164.2101999999,1787578.7999999998,1796355.96,0,0,0,0]

{"sheet":"Analyse graphique","index":2,"n_rows":269,"n_cols":1,"rows_kept":269,"cut":false,"hidden":false,"merged":[[11,0,11,12],[112,0,112,12],[266,0,266,12],[268,0,268,12]]}
[]
[]
[]
[]
[]
[]
[]
[]
[]
[]
[]
["Graphiques ELECTRICITE"]
[]
[]
[]
[]
[]
[]
[]
[]
[]
[]
[]
[]
[]
[]
[]
[]
[]
[]
{"$rows_left_out":240}
{"sheet":"Encodage","index":3,"n_rows":130,"n_cols":33,"rows_kept":130,"cut":false,"hidden":false,"merged":[[0,0,0,3]]}
["Encodage des données et des factures"]
[]
["Année du 1er encodage:",null,null,2013]
["Choix de degrés jours:",null,null,"16,5/16,5"]
["Secteur général:"]
["Nombre de bâtiments:",null,null,12]
[]
[null,"Aller à    --->",{"$f":"A12","v":2013},{"$f":"C8+1","v":2014},2015,{"$f":"E8+1","v":2016},{"$f":"F8+1","v":2017},{"$f":"G8+1","v":2018},{"$f":"H8+1","v":2019},{"$f":"I8+1","v":2020}]
[]
[null,"Nom du bâtiment \n","Surface chauffée","Affectation du bâtiment","Horaires d'occupa-tion du bâtiment","Usage énergétique spécifique","Energies renouvelables","Electricité (mono-horaire)","Electricité Heures pleines","Electricité Heures creuses","Coût total électricité",{"$f":"Paramètres!$A$3","v":"gaz naturel"},{"$f":"Paramètres!$A$4","v":"gasoil"},{"$f":"Paramètres!$A$5","v":"propane"},{"$f":"Paramètres!$A$6","v":"pellets"},{"$f":"Paramètres!$A$7","v":"Autres"},"Coût total combustible","Eau","Coût total Eau","Evol Conso Eau v/v année précédente","Electricité \n(total)","Elec Proportion Heure Creuse","Evol Conso Elec v/v année précédente","Cons spéc d'électricité","Cons spéc d'électricité moy du secteur (2012)","Combustible \n(total)","% de norma-lisation","Combustible\n(total) \nnormalisé","Cons spéc \nnormalisée \nde combustible","Evol Cons spéc normalisée de combustible v/v année précédente","Cons spéc chauffage moy du secteur (2012)","Evol Conso spéc normalisée de combustible v/v année du 1er encodage","Potentiel d'économie de combustible"]
[null,"Sélectionner les bâtiments","m²",null,null,null,null,"kWh","kWh","kWh","euro",{"$f":"Paramètres!$B$3","v":"kWhs"},{"$f":"Paramètres!$B$4","v":"litre"},{"$f":"Paramètres!$B$5","v":"m³"},{"$f":"Paramètres!$B$6","v":"kg"},{"$f":"Paramètres!$B$7","v":"kWh"},"euro","m³","euro","%","kWh","%","%","kWh/m²","kWh/m²","kWhi","%","kWhi","kWhi/m²","%","kWhi/m²","%","kWh²/m²"]
[{"$f":"D3","v":2013}]
[{"$f":"A12","v":2013},"Bâtiment 1",null,"A sélectionner dans la liste déroulante",null,"à encoder","à encoder",null,null,null,null,null,null,null,null,null,null,null,null,null,{"$f":"IF(H13<>0,H13,I13+J13)","v":0},{"$f":"IFERROR(J13/U13,\"NA\")","v":"NA"},{"$f":"IF(U13=0,0,U13/U13-1)","v":0},{"$f":"IFERROR(U13/C13,0)","v":0},{"$f":"VLOOKUP(D13,Paramètres!$A$24:$D$36,3)","v":100},{"$f":"L13*Paramètres!$C$3+M13*Paramètres!$C$4+Encodage!N13*Paramètres!$C$5+Encodage!O13*Paramètres!$C$6+P13*Paramètres!$C$7","v":0},{"$f":"VLOOKUP(D13,Paramètres!$A$24:$E$36,5)","v":0.85},{"$f":"IFERROR(Z13*(1-AA13)+(Z13*AA13*DJ!$D$2/VLOOKUP(Encodage!A13,DJ!$A$2:$D$14,4)),0)","v":0},{"$f":"IFERROR(AB13/C13,0)","v":0},null,{"$f":"VLOOKUP(D13,Paramètres!$A$24:$D$36,2)","v":100},{"$f":"IFERROR(AC13/AC$13,\"\")","v":""},{"$f":"AB13*AC13","v":0}]
[{"$f":"A12","v":2013},"Bâtiment 2",null,"A sélectionner dans la liste déroulante",null,"à encoder","à encoder",null,null,null,null,null,null,null,null,null,null,null,null,null,0,"NA",{"$f":"IF(U14=0,0,U14/U14-1)","v":0},0,{"$f":"VLOOKUP(D14,Paramètres!$A$24:$D$36,3)","v":100},{"$f":"L14*Paramètres!$C$3+M14*Paramètres!$C$4+Encodage!N14*Paramètres!$C$5+Encodage!O14*Paramètres!$C$6+P14*Paramètres!$C$7","v":0},{"$f":"VLOOKUP(D14,Paramètres!$A$24:$E$36,5)","v":0.85},{"$f":"IFERROR(Z14*(1-AA14)+(Z14*AA14*DJ!$D$2/VLOOKUP(Encodage!A14,DJ!$A$2:$D$14,4)),0)","v":0},0,null,{"$f":"VLOOKUP(D14,Paramètres!$A$24:$D$36,2)","v":100},"",0]
[{"$f":"A14","v":2013},"Bâtiment 3",null,"A sélectionner dans la liste déroulante",null,"à encoder","à encoder",null,null,null,null,null,null,null,null,null,null,null,null,null,0,"NA",0,0,{"$f":"VLOOKUP(D15,Paramètres!$A$24:$D$36,3)","v":100},{"$f":"L15*Paramètres!$C$3+M15*Paramètres!$C$4+Encodage!N15*Paramètres!$C$5+Encodage!O15*Paramètres!$C$6+P15*Paramètres!$C$7","v":0},{"$f":"VLOOKUP(D15,Paramètres!$A$24:$E$36,5)","v":0.85},{"$f":"IFERROR(Z15*(1-AA15)+(Z15*AA15*DJ!$D$2/VLOOKUP(Encodage!A15,DJ!$A$2:$D$14,4)),0)","v":0},0,null,{"$f":"VLOOKUP(D15,Paramètres!$A$24:$D$36,2)","v":100},"",0]
[2013,"Bâtiment 4",null,"A sélectionner dans la liste déroulante",null,"à encoder","à encoder",null,null,null,null,null,null,null,null,null,null,null,null,null,0,"NA",0,0,{"$f":"VLOOKUP(D16,Paramètres!$A$24:$D$36,3)","v":100},{"$f":"L16*Paramètres!$C$3+M16*Paramètres!$C$4+Encodage!N16*Paramètres!$C$5+Encodage!O16*Paramètres!$C$6+P16*Paramètres!$C$7","v":0},{"$f":"VLOOKUP(D16,Paramètres!$A$24:$E$36,5)","v":0.85},{"$f":"IFERROR(Z16*(1-AA16)+(Z16*AA16*DJ!$D$2/VLOOKUP(Encodage!A16,DJ!$A$2:$D$14,4)),0)","v":0},0,null,{"$f":"VLOOKUP(D16,Paramètres!$A$24:$D$36,2)","v":100},"",0]
[2013,"Bâtiment 5",null,"A sélectionner dans la liste déroulante",null,"à encoder","à encoder",null,null,null,null,null,null,null,null,null,null,null,null,null,0,"NA",0,0,{"$f":"VLOOKUP(D17,Paramètres!$A$24:$D$36,3)","v":100},{"$f":"L17*Paramètres!$C$3+M17*Paramètres!$C$4+Encodage!N17*Paramètres!$C$5+Encodage!O17*Paramètres!$C$6+P17*Paramètres!$C$7","v":0},{"$f":"VLOOKUP(D17,Paramètres!$A$24:$E$36,5)","v":0.85},{"$f":"IFERROR(Z17*(1-AA17)+(Z17*AA17*DJ!$D$2/VLOOKUP(Encodage!A17,DJ!$A$2:$D$14,4)),0)","v":0},0,null,{"$f":"VLOOKUP(D17,Paramètres!$A$24:$D$36,2)","v":100},"",0]
[2013,"Bâtiment 6",null,"A sélectionner dans la liste déroulante",null,"à encoder","à encoder",null,null,null,null,null,null,null,null,null,null,null,null,null,0,"NA",0,0,{"$f":"VLOOKUP(D18,Paramètres!$A$24:$D$36,3)","v":100},{"$f":"L18*Paramètres!$C$3+M18*Paramètres!$C$4+Encodage!N18*Paramètres!$C$5+Encodage!O18*Paramètres!$C$6+P18*Paramètres!$C$7","v":0},{"$f":"VLOOKUP(D18,Paramètres!$A$24:$E$36,5)","v":0.85},{"$f":"IFERROR(Z18*(1-AA18)+(Z18*AA18*DJ!$D$2/VLOOKUP(Encodage!A18,DJ!$A$2:$D$14,4)),0)","v":0},0,null,{"$f":"VLOOKUP(D18,Paramètres!$A$24:$D$36,2)","v":100},"",0]
[2013,"Bâtiment 7",null,"A sélectionner dans la liste déroulante",null,"à encoder","à encoder",null,null,null,null,null,null,null,null,null,null,null,null,null,0,"NA",0,0,{"$f":"VLOOKUP(D19,Paramètres!$A$24:$D$36,3)","v":100},{"$f":"L19*Paramètres!$C$3+M19*Paramètres!$C$4+Encodage!N19*Paramètres!$C$5+Encodage!O19*Paramètres!$C$6+P19*Paramètres!$C$7","v":0},{"$f":"VLOOKUP(D19,Paramètres!$A$24:$E$36,5)","v":0.85},{"$f":"IFERROR(Z19*(1-AA19)+(Z19*AA19*DJ!$D$2/VLOOKUP(Encodage!A19,DJ!$A$2:$D$14,4)),0)","v":0},0,null,{"$f":"VLOOKUP(D19,Paramètres!$A$24:$D$36,2)","v":100},"",0]
[2013,"Bâtiment 8",null,"A sélectionner dans la liste déroulante",null,"à encoder","à encoder",null,null,null,null,null,null,null,null,null,null,null,null,null,0,"NA",0,0,{"$f":"VLOOKUP(D20,Paramètres!$A$24:$D$36,3)","v":100},{"$f":"L20*Paramètres!$C$3+M20*Paramètres!$C$4+Encodage!N20*Paramètres!$C$5+Encodage!O20*Paramètres!$C$6+P20*Paramètres!$C$7","v":0},{"$f":"VLOOKUP(D20,Paramètres!$A$24:$E$36,5)","v":0.85},{"$f":"IFERROR(Z20*(1-AA20)+(Z20*AA20*DJ!$D$2/VLOOKUP(Encodage!A20,DJ!$A$2:$D$14,4)),0)","v":0},0,null,{"$f":"VLOOKUP(D20,Paramètres!$A$24:$D$36,2)","v":100},"",0]
[2013,"Bâtiment 9",null,"A sélectionner dans la liste déroulante",null,"à encoder","à encoder",null,null,null,null,null,null,null,null,null,null,null,null,null,0,"NA",0,0,{"$f":"VLOOKUP(D21,Paramètres!$A$24:$D$36,3)","v":100},{"$f":"L21*Paramètres!$C$3+M21*Paramètres!$C$4+Encodage!N21*Paramètres!$C$5+Encodage!O21*Paramètres!$C$6+P21*Paramètres!$C$7","v":0},{"$f":"VLOOKUP(D21,Paramètres!$A$24:$E$36,5)","v":0.85},{"$f":"IFERROR(Z21*(1-AA21)+(Z21*AA21*DJ!$D$2/VLOOKUP(Encodage!A21,DJ!$A$2:$D$14,4)),0)","v":0},0,null,{"$f":"VLOOKUP(D21,Paramètres!$A$24:$D$36,2)","v":100},"",0]
[2013,"Bâtiment 10",null,"A sélectionner dans la liste déroulante",null,"à encoder","à encoder",null,null,null,null,null,null,null,null,null,null,null,null,null,0,"NA",0,0,{"$f":"VLOOKUP(D22,Paramètres!$A$24:$D$36,3)","v":100},{"$f":"L22*Paramètres!$C$3+M22*Paramètres!$C$4+Encodage!N22*Paramètres!$C$5+Encodage!O22*Paramètres!$C$6+P22*Paramètres!$C$7","v":0},{"$f":"VLOOKUP(D22,Paramètres!$A$24:$E$36,5)","v":0.85},{"$f":"IFERROR(Z22*(1-AA22)+(Z22*AA22*DJ!$D$2/VLOOKUP(Encodage!A22,DJ!$A$2:$D$14,4)),0)","v":0},0,null,{"$f":"VLOOKUP(D22,Paramètres!$A$24:$D$36,2)","v":100},"",0]
[2013,"Bâtiment 11",null,"A sélectionner dans la liste déroulante",null,"à encoder","à encoder",null,null,null,null,null,null,null,null,null,null,null,null,null,0,"NA",0,0,{"$f":"VLOOKUP(D23,Paramètres!$A$24:$D$36,3)","v":100},{"$f":"L23*Paramètres!$C$3+M23*Paramètres!$C$4+Encodage!N23*Paramètres!$C$5+Encodage!O23*Paramètres!$C$6+P23*Paramètres!$C$7","v":0},{"$f":"VLOOKUP(D23,Paramètres!$A$24:$E$36,5)","v":0.85},{"$f":"IFERROR(Z23*(1-AA23)+(Z23*AA23*DJ!$D$2/VLOOKUP(Encodage!A23,DJ!$A$2:$D$14,4)),0)","v":0},0,null,{"$f":"VLOOKUP(D23,Paramètres!$A$24:$D$36,2)","v":100},"",0]
[2013,"Bâtiment 12",null,"A sélectionner dans la liste déroulante",null,"à encoder","à encoder",null,null,null,null,null,null,null,null,null,null,null,null,null,0,"NA",{"$f":"IF(U24=0,0,U24/U24-1)","v":0},0,{"$f":"VLOOKUP(D24,Paramètres!$A$24:$D$36,3)","v":100},{"$f":"L24*Paramètres!$C$3+M24*Paramètres!$C$4+Encodage!N24*Paramètres!$C$5+Encodage!O24*Paramètres!$C$6+P24*Paramètres!$C$7","v":0},{"$f":"VLOOKUP(D24,Paramètres!$A$24:$E$36,5)","v":0.85},{"$f":"IFERROR(Z24*(1-AA24)+(Z24*AA24*DJ!$D$2/VLOOKUP(Encodage!A24,DJ!$A$2:$D$14,4)),0)","v":0},0,null,{"$f":"VLOOKUP(D24,Paramètres!$A$24:$D$36,2)","v":100},"",0]
[2013,"Total",{"$f":"SUM(C13:C24)","v":0},null,null,null,null,{"$f":"SUM(H13:H24)","v":0},{"$f":"SUM(I13:I24)","v":0},{"$f":"SUM(J13:J24)","v":0},{"$f":"SUM(K13:K24)","v":0},{"$f":"SUM(L13:L24)","v":0},0,0,0,0,0,0,0,null,{"$f":"SUM(U13:U24)","v":0},null,null,0,{"$f":"VLOOKUP($D$5,Paramètres!$A$24:$D$36,3)","v":{"$error":"#N/A"}},{"$f":"SUM(Z13:Z24)","v":0},null,{"$f":"SUM(AB13:AB24)","v":0},0,null,{"$f":"VLOOKUP($D$5,Paramètres!$A$24:$D$36,2)","v":{"$error":"#N/A"}},""]
[]
[{"$f":"A12+1","v":2014}]
[{"$f":"A27","v":2014},{"$f":"B13","v":"Bâtiment 1"},0,"A sélectionner dans la liste déroulante",0,{"$f":"F13","v":"à encoder"},"à encoder",null,null,null,null,null,null,null,null,null,null,null,null,{"$f":"IF(R28=0,,R28/R13-1)","v":0},{"$f":"IF(H28<>0,H28,I28+J28)","v":0},{"$f":"IFERROR(J28/U28,\"NA\")","v":"NA"},{"$f":"IF(U28=0,0,U28/U13-1)","v":0},{"$f":"IFERROR(U28/C28,0)","v":0},{"$f":"VLOOKUP(D28,Paramètres!$A$24:$D$36,3)","v":100},{"$f":"L28*Paramètres!$C$3+M28*Paramètres!$C$4+Encodage!N28*Paramètres!$C$5+Encodage!O28*Paramètres!$C$6+P28*Paramètres!$C$7","v":0},{"$f":"VLOOKUP(D28,Paramètres!$A$24:$E$36,5)","v":0.85},{"$f":"IFERROR(Z28*(1-AA28)+(Z28*AA28*DJ!$D$2/VLOOKUP(Encodage!A28,DJ!$A$2:$D$14,4)),0)","v":0},{"$f":"IFERROR(AB28/C28,0)","v":0},{"$f":"IF(AB28=0,,AB28/AB13-1)","v":0},{"$f":"VLOOKUP(D28,Paramètres!$A$24:$D$36,2)","v":100},{"$f":"IFERROR(AC28/AC$13,\"\")","v":""},{"$f":"AB28*AC28","v":0}]
[{"$f":"A28","v":2014},"Bâtiment 2",0,"A sélectionner dans la liste déroulante",0,"à encoder","à encoder",null,null,null,null,null,null,null,null,null,null,null,null,{"$f":"IF(R29=0,,R29/R14-1)","v":0},0,"NA",0,0,{"$f":"VLOOKUP(D29,Paramètres!$A$24:$D$36,3)","v":100},{"$f":"L29*Paramètres!$C$3+M29*Paramètres!$C$4+Encodage!N29*Paramètres!$C$5+Encodage!O29*Paramètres!$C$6+P29*Paramètres!$C$7","v":0},{"$f":"VLOOKUP(D29,Paramètres!$A$24:$E$36,5)","v":0.85},{"$f":"IFERROR(Z29*(1-AA29)+(Z29*AA29*DJ!$D$2/VLOOKUP(Encodage!A29,DJ!$A$2:$D$14,4)),0)","v":0},0,{"$f":"IF(AB29=0,,AB29/AB14-1)","v":0},{"$f":"VLOOKUP(D29,Paramètres!$A$24:$D$36,2)","v":100},"",0]
[{"$f":"A29","v":2014},"Bâtiment 3",0,"A sélectionner dans la liste déroulante",0,"à encoder","à encoder",null,null,null,null,null,null,null,null,null,null,null,null,0,0,"NA",0,0,{"$f":"VLOOKUP(D30,Paramètres!$A$24:$D$36,3)","v":100},{"$f":"L30*Paramètres!$C$3+M30*Paramètres!$C$4+Encodage!N30*Paramètres!$C$5+Encodage!O30*Paramètres!$C$6+P30*Paramètres!$C$7","v":0},{"$f":"VLOOKUP(D30,Paramètres!$A$24:$E$36,5)","v":0.85},{"$f":"IFERROR(Z30*(1-AA30)+(Z30*AA30*DJ!$D$2/VLOOKUP(Encodage!A30,DJ!$A$2:$D$14,4)),0)","v":0},0,0,{"$f":"VLOOKUP(D30,Paramètres!$A$24:$D$36,2)","v":100},"",0]
{"$rows_left_out":101}
{"sheet":"Resumé","index":4,"n_rows":41,"n_cols":10,"rows_kept":41,"cut":false,"hidden":false,"merged":[[0,1,0,9]]}
[null,"Evolution des consommations totales de tous les bâtiments"]
[]
[null,"Consommations",{"$f":"Encodage!D3","v":2013},{"$f":"C3+1","v":2014},2015,2016,2017,2018,2019,2020]
[null,"Consommation Elec totale [kWh]",{"$f":"Encodage!$U25","v":0},{"$f":"Encodage!U40","v":0},{"$f":"Encodage!U55","v":0},{"$f":"Encodage!$U70","v":0},{"$f":"Encodage!$U85","v":0},{"$f":"Encodage!$U100","v":0},{"$f":"Encodage!$U115","v":0},{"$f":"Encodage!$U130","v":0}]
[null,"Cons. Elec heures pleines [kWh]",{"$f":"Encodage!$I25","v":0},{"$f":"Encodage!I40","v":0},{"$f":"Encodage!I55","v":0},{"$f":"Encodage!$I70","v":0},{"$f":"Encodage!$I85","v":0},{"$f":"Encodage!$I100","v":0},{"$f":"Encodage!$I115","v":0},{"$f":"Encodage!$I130","v":0}]
[null,"Cons. Elec heures creuses [kWh]",{"$f":"Encodage!$J25","v":0},{"$f":"Encodage!J40","v":0},{"$f":"Encodage!J55","v":0},{"$f":"Encodage!$J70","v":0},{"$f":"Encodage!$J85","v":0},{"$f":"Encodage!$J100","v":0},{"$f":"Encodage!$J115","v":0},{"$f":"Encodage!$J130","v":0}]
[null,"Cons. élect spécifique [kWh/m²]",{"$f":"IFERROR(Encodage!$X25,0)","v":0},{"$f":"IFERROR(Encodage!$X40,0)","v":0},{"$f":"IFERROR(Encodage!$X55,0)","v":0},{"$f":"IFERROR(Encodage!$X70,0)","v":0},{"$f":"IFERROR(Encodage!$X85,0)","v":0},{"$f":"IFERROR(Encodage!$X100,0)","v":0},{"$f":"IFERROR(Encodage!$X115,0)","v":0},{"$f":"IFERROR(Encodage!$X130,0)","v":0}]
[null,{"$f":"\"Cons. moyenne du secteur (= \"&C8&\" kWh/m²)\"","v":{"$error":"#N/A"}},{"$f":"VLOOKUP(Encodage!D5,Paramètres!$A$24:$D$36,3)","v":{"$error":"#N/A"}},{"$f":"$C$8","v":{"$error":"#N/A"}},{"$f":"$C$8","v":{"$error":"#N/A"}},{"$error":"#N/A"},{"$error":"#N/A"},{"$error":"#N/A"},{"$error":"#N/A"},{"$error":"#N/A"}]
[null,"Consommation de combustibles [kWhi]",{"$f":"Encodage!$Z25","v":0},{"$f":"Encodage!Z40","v":0},{"$f":"Encodage!Z55","v":0},{"$f":"Encodage!$Z70","v":0},{"$f":"Encodage!$Z85","v":0},{"$f":"Encodage!$Z100","v":0},{"$f":"Encodage!$Z115","v":0},{"$f":"Encodage!$Z130","v":0}]
[null,"Cons. de combustible normalisé [kWhi]",{"$f":"Encodage!$AB25","v":0},{"$f":"Encodage!$AB40","v":0},{"$f":"Encodage!$AB55","v":0},{"$f":"Encodage!$AB70","v":0},{"$f":"Encodage!$AB85","v":0},{"$f":"Encodage!$AB100","v":0},{"$f":"Encodage!$AB115","v":0},{"$f":"Encodage!$AB130","v":0}]
[null,"Cons. combustible spécifique normalisée [kWhi/m²]",{"$f":"IFERROR(Encodage!$AC25,0)","v":0},{"$f":"IFERROR(Encodage!AC40,0)","v":0},{"$f":"IFERROR(Encodage!AC55,0)","v":0},{"$f":"IFERROR(Encodage!$AC70,0)","v":0},{"$f":"IFERROR(Encodage!$AC85,0)","v":0},{"$f":"IFERROR(Encodage!$AC100,0)","v":0},{"$f":"IFERROR(Encodage!$AC115,0)","v":0},{"$f":"IFERROR(Encodage!$AC130,0)","v":0}]
[null,{"$f":"\"Consommation moyenne du secteur (= \"&C12&\" kWh/m²)\"","v":{"$error":"#N/A"}},{"$f":"VLOOKUP(Encodage!D5,Paramètres!$A$24:$D$36,2)","v":{"$error":"#N/A"}},{"$f":"$C$12","v":{"$error":"#N/A"}},{"$error":"#N/A"},{"$error":"#N/A"},{"$error":"#N/A"},{"$error":"#N/A"},{"$error":"#N/A"},{"$error":"#N/A"}]
[null,"Degrés jours (16,5/16,5)",{"$f":"VLOOKUP(C3,DJ!$A$3:$D$14,4)","v":2537},{"$f":"VLOOKUP(D3,DJ!$A$3:$D$14,4)","v":1828},{"$f":"VLOOKUP(E3,DJ!$A$3:$D$14,4)","v":2112},{"$f":"VLOOKUP(F3,DJ!$A$3:$D$14,4)","v":0},{"$f":"VLOOKUP(G3,DJ!$A$3:$D$14,4)","v":0},{"$f":"VLOOKUP(H3,DJ!$A$3:$D$14,4)","v":0},{"$f":"VLOOKUP(I3,DJ!$A$3:$D$14,4)","v":0},{"$f":"VLOOKUP(J3,DJ!$A$3:$D$14,4)","v":0}]
[null,"Eau (m³)",{"$f":"Encodage!$R25","v":0},{"$f":"Encodage!R40","v":0},{"$f":"Encodage!R55","v":0},{"$f":"Encodage!$R70","v":0},{"$f":"Encodage!$R85","v":0},{"$f":"Encodage!$R100","v":0},{"$f":"Encodage!$R115","v":0},{"$f":"Encodage!$R130","v":0}]
[null,"Coût total elec (€)",{"$f":"Encodage!$K$25","v":0},{"$f":"Encodage!$K$40","v":0},{"$f":"Encodage!$K$55","v":0},{"$f":"Encodage!$K$70","v":0},{"$f":"Encodage!$K$85","v":0},{"$f":"Encodage!$K$100","v":0},{"$f":"Encodage!K115","v":0},{"$f":"Encodage!$K$130","v":0}]
[null,"Coût total combustible (€)",{"$f":"Encodage!$Q$25","v":0},{"$f":"Encodage!$Q$40","v":0},{"$f":"Encodage!$Q$55","v":0},{"$f":"Encodage!$Q$70","v":0},{"$f":"Encodage!$Q$85","v":0},{"$f":"Encodage!$Q$100","v":0},{"$f":"Encodage!Q116","v":0},{"$f":"Encodage!$Q$130","v":0}]
[null,"Coût total eau (€)",{"$f":"Encodage!$S$25","v":0},{"$f":"Encodage!$S$40","v":0},{"$f":"Encodage!$S$55","v":0},{"$f":"Encodage!$S$70","v":0},{"$f":"Encodage!$S$85","v":0},{"$f":"Encodage!$S$100","v":0},{"$f":"Encodage!S117","v":0},{"$f":"Encodage!$S$130","v":0}]
[]
[null,"Evolution par rapport à l’année du 1er encodage",{"$f":"C3","v":2013},2014,2015,2016,2017,2018,2019,2020]
[null,{"$f":"B4","v":"Consommation Elec totale [kWh]"},{"$f":"IFERROR(C4/$C4,0)","v":0},{"$f":"IFERROR(D4/$C4,0)","v":0},0,0,0,0,0,0]
[null,{"$f":"B5","v":"Cons. Elec heures pleines [kWh]"},{"$f":"IFERROR(C5/$C5,0)","v":0},0,0,0,0,0,0,0]
[null,{"$f":"B6","v":"Cons. Elec heures creuses [kWh]"},{"$f":"IFERROR(C6/$C6,0)","v":0},{"$f":"IFERROR(D6/$C6,0)","v":0},0,0,0,0,0,0]
[null,{"$f":"B9","v":"Consommation de combustibles [kWhi]"},{"$f":"IFERROR(C9/$C9,0)","v":0},{"$f":"IFERROR(D9/$C9,0)","v":0},0,0,0,0,0,0]
[null,{"$f":"B10","v":"Cons. de combustible normalisé [kWhi]"},{"$f":"IFERROR(C10/$C10,0)","v":0},{"$f":"IFERROR(D10/$C10,0)","v":0},0,0,0,0,0,0]
[null,{"$f":"B11","v":"Cons. combustible spécifique normalisée [kWhi/m²]"},{"$f":"IFERROR(C11/$C11,0)","v":0},{"$f":"IFERROR(D11/$C11,0)","v":0},0,0,0,0,0,0]
[null,{"$f":"B14","v":"Eau (m³)"},{"$f":"IFERROR(C14/$C14,0)","v":0},{"$f":"IFERROR(D14/$C14,0)","v":0},0,0,0,0,0,0]
[null,"Coût total elec",{"$f":"IFERROR(C15/$C15,0)","v":0},0,0,0,0,0,0,0]
[null,"Coût total combustible",{"$f":"IFERROR(C16/$C16,0)","v":0},0,0,0,0,0,0,0]
[null,"Coût total eau",{"$f":"IFERROR(C17/$C17,0)","v":0},0,0,0,0,0,0,0]
[]
{"$rows_left_out":12}
{"sheet":"G_Elec","index":5,"n_rows":106,"n_cols":17,"rows_kept":106,"cut":false,"hidden":false,"merged":[[104,16,104,20],[105,16,105,20],[104,0,104,5],[104,6,104,10],[105,0,105,5],[105,6,105,10],[104,11,104,15],[105,11,105,15],[81,0,81,5],[81,6,81,10],[81,11,81,15],[81,16,81,20],[82,0,82,5],[82,6,82,10],[82,11,82,15],[82,16,82,20]]}
[]
[]
[]
[]
[]
[]
[]
[]
[]
[]
[]
[]
[]
[]
[]
[]
[]
[]
[]
[]
[]
[]
[]
[]
[]
[]
[]
[]
[]
[]
{"$rows_left_out":77}
{"sheet":"Feuil1","index":6,"n_rows":0,"n_cols":0,"rows_kept":0,"cut":false,"hidden":true,"merged":[]}

{"sheet":"G_Combustible","index":7,"n_rows":0,"n_cols":0,"rows_kept":0,"cut":false,"hidden":false,"merged":[[40,0,40,5],[40,6,40,10],[59,6,59,10]]}

{"sheet":"G_Eau","index":8,"n_rows":0,"n_cols":0,"rows_kept":0,"cut":false,"hidden":false,"merged":[[23,0,23,5],[23,6,23,10]]}

{"sheet":"Paramètres","index":9,"n_rows":62,"n_cols":5,"rows_kept":62,"cut":false,"hidden":true,"merged":[]}
["Coefficients de conversion:"]
["Electricité","kWh",2.5,{"$f":"\"kWhp\"&\"/\"&B2","v":"kWhp/kWh"}]
["gaz naturel","kWhs",0.90300000000000002,"kWhp/kWhs"]
["gasoil","litre",{"$f":"36500/3600","v":10.138888888888889},"kWhp/litre"]
["propane","m³",6.5555555555555554,"kWhp/m³"]
["pellets","kg",4,"kWhp/kg"]
["Autres","kWh",1,"kWhp/kWh"]
[]
["Usage énergétique"]
["Chauffage"]
["Eau chaude sanitaire (ECS)"]
["Cuisine"]
["Ch + ECS"]
["Ch + cuisine"]
["ECS + Cuisine"]
["Ch + ECS + Cuisine"]
["cuisine collective"]
["air-conditionné"]
["chauffage électrique"]
["piscine"]
[]
["Consommation moyenne du secteur (2012)"]
[null,"Chauffage","Elec",null,"Rapport Normalisation"]
[{"$f":"DJ!A17","v":"A sélectionner dans la liste déroulante"},100,100,"kWh/m²",{"$f":"DJ!B17","v":0.85}]
[{"$f":"DJ!A18","v":"Accueil de jour"},0,0,"kWh/m²",{"$f":"DJ!B18","v":0.85}]
[{"$f":"DJ!A19","v":"Bureau privé HT"},102,138,"kWh/m²",{"$f":"DJ!B19","v":0.85}]
[{"$f":"DJ!A20","v":"Bureau public HT"},165,65,"kWh/m²",{"$f":"DJ!B20","v":0.85}]
[{"$f":"DJ!A21","v":"Centre d’insertion socio-professionnel"},0,0,"kWh/m²",{"$f":"DJ!B21","v":0.85}]
[{"$f":"DJ!A22","v":"Crèche"},0,0,"kWh/m²",{"$f":"DJ!B22","v":0.85}]
[{"$f":"DJ!A23","v":"École"},143,26,"kWh/m²",{"$f":"DJ!B23","v":0.85}]
{"$rows_left_out":33}
{"sheet":"DJ","index":10,"n_rows":29,"n_cols":6,"rows_kept":29,"cut":false,"hidden":false,"merged":[[1,5,1,9]]}
["Degrés jours","15/15","16,5/16,5",{"$f":"IF(Encodage!$D$4=$B$1,B1,C1)","v":"16,5/16,5"}]
["degré jour normaux",1913,2301,{"$f":"IF(Encodage!$D$4=$B$1,B2,C2)","v":2301},null,"Les degrés jours normaux  sont  la  moyenne des degrés jours des 30 dernières années (de 1986 à 2015). Cette  moyenne est revue par l'IRM tous les 5 ans "]
[2009,1819.7,2212,{"$f":"IF(Encodage!$D$4=$B$1,B3,C3)","v":2212}]
[2010,2309,2703,{"$f":"IF(Encodage!$D$4=$B$1,B4,C4)","v":2703}]
[2011,1514.5,1928,{"$f":"IF(Encodage!$D$4=$B$1,B5,C5)","v":1928}]
[2012,1914.7,2327,{"$f":"IF(Encodage!$D$4=$B$1,B6,C6)","v":2327}]
[2013,2137.6999999999998,2537,{"$f":"IF(Encodage!$D$4=$B$1,B7,C7)","v":2537}]
[2014,1424.1,1828,{"$f":"IF(Encodage!$D$4=$B$1,B8,C8)","v":1828}]
[2015,"1688.3 ",2112,{"$f":"IF(Encodage!$D$4=$B$1,B9,C9)","v":2112}]
[2016,null,null,{"$f":"IF(Encodage!$D$4=$B$1,B10,C10)","v":0}]
[2017,null,null,{"$f":"IF(Encodage!$D$4=$B$1,B11,C11)","v":0}]
[2018,null,null,{"$f":"IF(Encodage!$D$4=$B$1,B12,C12)","v":0}]
[2019,null,null,{"$f":"IF(Encodage!$D$4=$B$1,B13,C13)","v":0}]
[2020,null,null,{"$f":"IF(Encodage!$D$4=$B$1,B14,C14)","v":0}]
[]
["Rapport Normalisation"]
["A sélectionner dans la liste déroulante",0.85]
["Accueil de jour",0.85]
["Bureau privé HT",0.85]
["Bureau public HT",0.85]
["Centre d’insertion socio-professionnel",0.85]
["Crèche",0.85]
["École",0.85]
["Entreprise de travail adapté",0.85]
["Etablissement culturel",0.85]
["Etablissement sportif",0.85]
["Hébergement",0.7]
["Hôpitaux",0.7]
["autre",0.85]